Reaction Details
TargetD(1A) dopamine receptor
LigandBDBM337366
Substrate/Competitorn/a
Meas. Tech.Binding Assay
Ki 14.0±n/a nM
Citation Gray, DLZhang, LBrodney, MADavoren, JEEfremov, IVGreen, MEO Neil, SVRogers, BN Heterocyclic compounds and their use as dopamine D1 ligands US Patent US9745317 Publication Date 8/29/2017
 
D(1A) dopamine receptor
Name:D(1A) dopamine receptor
Type:Enzyme
Mol. Mass.:49303.43
Organism:Homo sapiens (Human)
Description:P21728
Residue:446
BDBM337366
NameBDBM337366
Synonyms:5-[4-(2,3-Dihydro-1H-pyrrolo[3,2-c]pyridin-4-yloxy)phenyl]-4,6-dimethylpyridazin-3(2H)-one (4) | US9745317, 4
TypeSmall organic molecule
Emp. Form.C43H40N4O3
Mol. Mass.660.8027
SMILESCc1nn(C2CCCCO2)c(=O)c(C)c1-c1ccc(Oc2nccc3N(CCc23)C(c2ccccc2)(c2ccccc2)c2ccccc2)cc1