Reaction Details
TargetD(1A) dopamine receptor
LigandBDBM337383
Substrate/Competitorn/a
Meas. Tech.Binding Assay
Ki 202±n/a nM
Citation Gray, DLZhang, LBrodney, MADavoren, JEEfremov, IVGreen, MEO Neil, SVRogers, BN Heterocyclic compounds and their use as dopamine D1 ligands US Patent US9745317 Publication Date 8/29/2017
 
D(1A) dopamine receptor
Name:D(1A) dopamine receptor
Type:Enzyme
Mol. Mass.:49303.43
Organism:Homo sapiens (Human)
Description:P21728
Residue:446
BDBM337383
NameBDBM337383
Synonyms:US9745317, 21 US9745317, 23
TypeSmall organic molecule
Emp. Form.C20H19N3O3
Mol. Mass.349.3832
SMILESCc1cc(Oc2nccc3OCCc23)ccc1-c1c(C)ncc(=O)n1C