Reaction Details
TargetDipeptidyl peptidase 1
LigandBDBM201018
Substrate/Competitorn/a
Meas. Tech.Inhibition of Human DPPI (Cathepsin C)
Temperature298.15±n/a K
IC50 0.500±0 nM
Commentsextracted
Citation Vintonyak, VGrauert, MGrundl, MPautsch, A Substituted spirocycles US Patent US9540373 Publication Date 1/10/2017
 
Dipeptidyl peptidase 1
Name:Dipeptidyl peptidase 1
Type:Enzyme
Mol. Mass.:51857.28
Organism:Homo sapiens (Human)
Description:P53634
Residue:463
BDBM201018
NameBDBM201018
Synonyms:US9540373, 7 USRE47636, Example 7
TypeSmall organic molecule
Emp. Form.C28H29FN4O3
Mol. Mass.488.5533
SMILESFc1cc(ccc1C[C@H](NC(=O)[C@H]1N[C@@H]2CC[C@H]1C2)C#N)-c1ccc2C(=O)OC3(CCNCC3)c2c1