Reaction Details
TargetFlap endonuclease 1
LigandBDBM168691
Substrate/Competitorn/a
Meas. Tech.Binding Assay
Ki 1.000±n/a nM
Citation Bacani, GMEccles, WFitzgerald, AEGoldberg, SDHack, MDHawryluk, NAJones, WMKeith, JMKrawczuk, PLebsack, ADLee-Dutra, ALiu, JMcClure, KJMeduna, SPPippel, DJRosen, MDSales, ZS Flap modulators US Patent US9745328 Publication Date 8/29/2017
 
Flap endonuclease 1
Name:Flap endonuclease 1
Type:PROTEIN
Mol. Mass.:42602.57
Organism:Homo sapiens (Human)
Description:ChEMBL_1517026
Residue:380
BDBM168691
NameBDBM168691
Synonyms:US9079866, 68 US9884878, Compound 68
TypeSmall organic molecule
Emp. Form.C22H23FN4O3S
Mol. Mass.442.506
SMILESNc1cnc(cn1)-c1ccc(cc1F)-c1ccccc1S(=O)(=O)N1CCC(CO)CC1