Reaction Details
TargetFlap endonuclease 1
LigandBDBM169037
Substrate/Competitorn/a
Meas. Tech.Binding Assay
Ki 1.000±n/a nM
Citation Bacani, GMEccles, WFitzgerald, AEGoldberg, SDHack, MDHawryluk, NAJones, WMKeith, JMKrawczuk, PLebsack, ADLee-Dutra, ALiu, JMcClure, KJMeduna, SPPippel, DJRosen, MDSales, ZS Flap modulators US Patent US9745328 Publication Date 8/29/2017
 
Flap endonuclease 1
Name:Flap endonuclease 1
Type:PROTEIN
Mol. Mass.:42602.57
Organism:Homo sapiens (Human)
Description:ChEMBL_1517026
Residue:380
BDBM169037
NameBDBM169037
Synonyms:US9079866, 438 US9884878, Compound 438
TypeSmall organic molecule
Emp. Form.C18H19FN4O2S2
Mol. Mass.406.497
SMILESCC(C)(C)NS(=O)(=O)c1ccccc1-c1ccc(-c2nnc(N)s2)c(F)c1