Reaction Details
TargetFlap endonuclease 1
LigandBDBM169122
Substrate/Competitorn/a
Meas. Tech.Binding Assay
Ki 1.000±n/a nM
Citation Bacani, GMEccles, WFitzgerald, AEGoldberg, SDHack, MDHawryluk, NAJones, WMKeith, JMKrawczuk, PLebsack, ADLee-Dutra, ALiu, JMcClure, KJMeduna, SPPippel, DJRosen, MDSales, ZS Flap modulators US Patent US9745328 Publication Date 8/29/2017
 
Flap endonuclease 1
Name:Flap endonuclease 1
Type:PROTEIN
Mol. Mass.:42602.57
Organism:Homo sapiens (Human)
Description:ChEMBL_1517026
Residue:380
BDBM169122
NameBDBM169122
Synonyms:US9079866, 523 US9884878, Compound 523
TypeSmall organic molecule
Emp. Form.C23H16FN5O
Mol. Mass.397.4044
SMILESNc1nccc(Oc2ccccc2-c2ccc(c(F)c2)-c2cnc3[nH]ccc3c2)n1