Reaction Details
TargetFlap endonuclease 1
LigandBDBM169201
Substrate/Competitorn/a
Meas. Tech.Binding Assay
Ki 0.600±n/a nM
Citation Bacani, GMEccles, WFitzgerald, AEGoldberg, SDHack, MDHawryluk, NAJones, WMKeith, JMKrawczuk, PLebsack, ADLee-Dutra, ALiu, JMcClure, KJMeduna, SPPippel, DJRosen, MDSales, ZS Flap modulators US Patent US9745328 Publication Date 8/29/2017
 
Flap endonuclease 1
Name:Flap endonuclease 1
Type:PROTEIN
Mol. Mass.:42602.57
Organism:Homo sapiens (Human)
Description:ChEMBL_1517026
Residue:380
BDBM169201
NameBDBM169201
Synonyms:US9079866, 602 US9884878, Compound 602
TypeSmall organic molecule
Emp. Form.C26H18F2N6
Mol. Mass.452.4581
SMILESNc1cnc(cn1)-c1ccc(cc1F)-c1ccccc1-c1ccc(c(F)c1)-c1cnc(N)cn1