Reaction Details
TargetFlap endonuclease 1
LigandBDBM337627
Substrate/Competitorn/a
Meas. Tech.Binding Assay
Ki 0.500±n/a nM
Citation Bacani, GMEccles, WFitzgerald, AEGoldberg, SDHack, MDHawryluk, NAJones, WMKeith, JMKrawczuk, PLebsack, ADLee-Dutra, ALiu, JMcClure, KJMeduna, SPPippel, DJRosen, MDSales, ZS Flap modulators US Patent US9745328 Publication Date 8/29/2017
 
Flap endonuclease 1
Name:Flap endonuclease 1
Type:PROTEIN
Mol. Mass.:42602.57
Organism:Homo sapiens (Human)
Description:ChEMBL_1517026
Residue:380
BDBM337627
NameBDBM337627
Synonyms:5-(4-{2-[(1,1-Dioxidotetrahydra-2H- thiopyran-4-yl)sulfonyl]-6- (trifluoromethyl)pyridin-3-yl}-2- fluorophenyl)pyrazin-2-amine | US9745328, Compound 912
TypeSmall organic molecule
Emp. Form.C21H18F4N4O4S2
Mol. Mass.530.516
SMILESNc1cnc(cn1)-c1ccc(cc1F)-c1ccc(nc1S(=O)(=O)C1CCS(=O)(=O)CC1)C(F)(F)F