Reaction Details
TargetHistone deacetylase 6
LigandBDBM239061
Substrate/Competitorn/a
Meas. Tech.Inhibition Assay
IC50 6.90±n/a nM
Citation Sotomayor, EMBergman, JAKozikowski, APVillagra, AVWoan, KV Selective histone deactylase 6 inhibitors US Patent US9751832 Publication Date 9/5/2017
 
Histone deacetylase 6
Name:Histone deacetylase 6
Type:Chromatin regulator; hydrolase; repressor
Mol. Mass.:131381.51
Organism:Homo sapiens (Human)
Description:Q9UBN7
Residue:1215
BDBM239061
NameBDBM239061
Synonyms:US10227295, Compound 9c US9751832, Compound 9c | US9956192, Compound 9c
TypeSmall organic molecule
Emp. Form.C13H14N4O4
Mol. Mass.290.2747
SMILESCc1cc(NC(=O)NCc2ccc(cc2)C(=O)NO)no1