Reaction Details
TargetHistone deacetylase 6
LigandBDBM337665
Substrate/Competitorn/a
Meas. Tech.Inhibition Assay
IC50 2.54±n/a nM
Citation Sotomayor, EMBergman, JAKozikowski, APVillagra, AVWoan, KV Selective histone deactylase 6 inhibitors US Patent US9751832 Publication Date 9/5/2017
 
Histone deacetylase 6
Name:Histone deacetylase 6
Type:Chromatin regulator; hydrolase; repressor
Mol. Mass.:131381.51
Organism:Homo sapiens (Human)
Description:Q9UBN7
Residue:1215
BDBM337665
NameBDBM337665
Synonyms:US10227295, Compound JB7-19 | US9751832, Compound JB7-19
TypeSmall organic molecule
Emp. Form.C20H23N5O3
Mol. Mass.381.4283
SMILESCCCCN(Cc1ccc(cc1)C(=O)NO)C(=O)Nc1ccc2cn[nH]c2c1