Reaction Details
TargetDipeptidyl peptidase 4
LigandBDBM13805
Substrate/CompetitorBDBM11057
Meas. Tech.DPP Inhibition Assay
pH7.5±n/a
Temperature295.15±n/a K
Ki 11±n/a nM
Citation Kurukulasuriya, RRohde, JJSzczepankiewicz, BGBasha, FLai, CJae, HSWinn, MStewart, KDLongenecker, KLLubben, TWBallaron, SJSham, HLvon Geldern, TW Xanthine mimetics as potent dipeptidyl peptidase IV inhibitors. Bioorg Med Chem Lett16:6226-30 (2006) 
 
Dipeptidyl peptidase 4
Name:Dipeptidyl peptidase 4
Type:Enzyme
Mol. Mass.:88271.01
Organism:Homo sapiens (Human)
Description:P27487
Residue:766
BDBM13805
BDBM11057
NameBDBM13805
Synonyms:2-{[2-(3-aminopiperidin-1-yl)-5,6-dimethyl-4,7-dioxo-1H,4H,5H,6H,7H-imidazo[4,5-d]pyridazin-1-yl]methyl}benzonitrile | Xanthine mimetic compound 20
TypeSmall organic molecule
Emp. Form.C20H23N7O2
Mol. Mass.393.4423
SMILESCn1n(C)c(=O)c2n(Cc3ccccc3C#N)c(nc2c1=O)N1CCCC(N)C1