Reaction Details
TargetCoagulation factor X
LigandBDBM13819
Substrate/CompetitorBDBM12500
Meas. Tech.Factor Xa Inhibition Assay
pH7.8±n/a
Temperature298.15±n/a K
Ki 85±n/a nM
Citation Matter, HDefossa, EHeinelt, UBlohm, PMSchneider, DMuller, AHerok, SSchreuder, HLiesum, ABrachvogel, VLonze, PWalser, AAl-Obeidi, FWildgoose, P Design and quantitative structure-activity relationship of 3-amidinobenzyl-1H-indole-2-carboxamides as potent, nonchiral, and selective inhibitors of blood coagulation factor Xa. J Med Chem45:2749-69 (2002) 
 
Coagulation factor X
Name:Coagulation factor X
Type:Enzyme
Mol. Mass.:54726.60
Organism:Homo sapiens (Human)
Description:n/a
Residue:488
BDBM13819
BDBM12500
NameBDBM13819
Synonyms:3-amidinobenzylindole carboxamide 3 | 3-bromo-1-[(3-carbamimidoylphenyl)methyl]-N-[(3,5-dichlorophenyl)methyl]-1H-indole-2-carboxamide
TypeSmall organic molecule
Emp. Form.C24H19BrCl2N4O
Mol. Mass.530.244
SMILESNC(=N)c1cccc(Cn2c(C(=O)NCc3cc(Cl)cc(Cl)c3)c(Br)c3ccccc23)c1