Reaction Details
TargetCoagulation factor X
LigandBDBM13856
Substrate/CompetitorBDBM12500
Meas. Tech.Factor Xa Inhibition Assay
Ki 99±n/a nM
Citation Matter, HDefossa, EHeinelt, UBlohm, PMSchneider, DMuller, AHerok, SSchreuder, HLiesum, ABrachvogel, VLonze, PWalser, AAl-Obeidi, FWildgoose, P Design and quantitative structure-activity relationship of 3-amidinobenzyl-1H-indole-2-carboxamides as potent, nonchiral, and selective inhibitors of blood coagulation factor Xa. J Med Chem45:2749-69 (2002) 
 
Coagulation factor X
Name:Coagulation factor X
Type:Enzyme
Mol. Mass.:54726.60
Organism:Homo sapiens (Human)
Description:n/a
Residue:488
BDBM13856
BDBM12500
NameBDBM13856
Synonyms:3-amidinobenzylindole carboxamide 40 | N-{[3,5-bis(trifluoromethyl)phenyl]methyl}-1-[(3-carbamimidoylphenyl)methyl]-4-hydroxy-1H-indole-2-carboxamide
TypeSmall organic molecule
Emp. Form.C26H20F6N4O2
Mol. Mass.534.453
SMILESNC(=N)c1cccc(Cn2c(cc3c(O)cccc23)C(=O)NCc2cc(cc(c2)C(F)(F)F)C(F)(F)F)c1