Reaction Details
TargetProthrombin
LigandBDBM12402
Substrate/CompetitorBDBM13573
Meas. Tech.Thrombin Inhibition Assay
Ki 1610±n/a nM
Citation Matter, HDefossa, EHeinelt, UBlohm, PMSchneider, DMuller, AHerok, SSchreuder, HLiesum, ABrachvogel, VLonze, PWalser, AAl-Obeidi, FWildgoose, P Design and quantitative structure-activity relationship of 3-amidinobenzyl-1H-indole-2-carboxamides as potent, nonchiral, and selective inhibitors of blood coagulation factor Xa. J Med Chem45:2749-69 (2002) 
 
Prothrombin
Name:Prothrombin
Type:Protein
Mol. Mass.:70029.57
Organism:Homo sapiens (Human)
Description:P00734
Residue:622
BDBM12402
BDBM13573
NameBDBM12402
Synonyms:1-[(3-carbamimidoylphenyl)methyl]-N-[(3,5-dichlorophenyl)methyl]-4-methyl-1H-indole-2-carboxamide 3-amidinobenzylindole carboxamide 41
TypeSmall organic molecule
Emp. Form.C25H22Cl2N4O
Mol. Mass.465.374
SMILESCc1cccc2n(Cc3cccc(c3)C(N)=N)c(cc12)C(=O)NCc1cc(Cl)cc(Cl)c1