Reaction Details
TargetCoagulation factor X
LigandBDBM13859
Substrate/CompetitorBDBM12500
Meas. Tech.Factor Xa Inhibition Assay
Ki 191±n/a nM
Citation Matter, HDefossa, EHeinelt, UBlohm, PMSchneider, DMuller, AHerok, SSchreuder, HLiesum, ABrachvogel, VLonze, PWalser, AAl-Obeidi, FWildgoose, P Design and quantitative structure-activity relationship of 3-amidinobenzyl-1H-indole-2-carboxamides as potent, nonchiral, and selective inhibitors of blood coagulation factor Xa. J Med Chem45:2749-69 (2002) 
 
Coagulation factor X
Name:Coagulation factor X
Type:Enzyme
Mol. Mass.:54726.60
Organism:Homo sapiens (Human)
Description:n/a
Residue:488
BDBM13859
BDBM12500
NameBDBM13859
Synonyms:1-[(3-carbamimidoylphenyl)methyl]-N-[(3,5-difluorophenyl)methyl]-4-hydroxy-1H-indole-2-carboxamide | 3-amidinobenzylindole carboxamide 43
TypeSmall organic molecule
Emp. Form.C24H20F2N4O2
Mol. Mass.434.438
SMILESNC(=N)c1cccc(Cn2c(cc3c(O)cccc23)C(=O)NCc2cc(F)cc(F)c2)c1