Reaction Details
TargetCoagulation factor X
LigandBDBM13862
Substrate/CompetitorBDBM12500
Meas. Tech.Factor Xa Inhibition Assay
Ki 11±n/a nM
Citation Matter, HDefossa, EHeinelt, UBlohm, PMSchneider, DMuller, AHerok, SSchreuder, HLiesum, ABrachvogel, VLonze, PWalser, AAl-Obeidi, FWildgoose, P Design and quantitative structure-activity relationship of 3-amidinobenzyl-1H-indole-2-carboxamides as potent, nonchiral, and selective inhibitors of blood coagulation factor Xa. J Med Chem45:2749-69 (2002) 
 
Coagulation factor X
Name:Coagulation factor X
Type:Enzyme
Mol. Mass.:54726.60
Organism:Homo sapiens (Human)
Description:n/a
Residue:488
BDBM13862
BDBM12500
NameBDBM13862
Synonyms:1-[(3-carbamimidoylphenyl)methyl]-N-[(3,5-dimethylphenyl)methyl]-4-hydroxy-1H-indole-2-carboxamide CHEMBL307196
TypeSmall organic molecule
Emp. Form.C26H26N4O2
Mol. Mass.426.5102
SMILESCc1cc(C)cc(CNC(=O)c2cc3c(O)cccc3n2Cc2cccc(c2)C(N)=N)c1