Reaction Details
TargetCoagulation factor X
LigandBDBM13863
Substrate/CompetitorBDBM12500
Meas. Tech.Factor Xa Inhibition Assay
Ki 7±n/a nM
Citation Matter, HDefossa, EHeinelt, UBlohm, PMSchneider, DMuller, AHerok, SSchreuder, HLiesum, ABrachvogel, VLonze, PWalser, AAl-Obeidi, FWildgoose, P Design and quantitative structure-activity relationship of 3-amidinobenzyl-1H-indole-2-carboxamides as potent, nonchiral, and selective inhibitors of blood coagulation factor Xa. J Med Chem45:2749-69 (2002) 
 
Coagulation factor X
Name:Coagulation factor X
Type:Enzyme
Mol. Mass.:54726.60
Organism:Homo sapiens (Human)
Description:n/a
Residue:488
BDBM13863
BDBM12500
NameBDBM13863
Synonyms:3-amidinobenzylindole carboxamide 47 | N,1-bis[(3-carbamimidoylphenyl)methyl]-4-methyl-1H-indole-2-carboxamide
TypeSmall organic molecule
Emp. Form.C26H26N6O
Mol. Mass.438.5242
SMILESCc1cccc2n(Cc3cccc(c3)C(N)=N)c(cc12)C(=O)NCc1cccc(c1)C(N)=N