Reaction Details
TargetCoagulation factor X
LigandBDBM13898
Substrate/CompetitorBDBM12500
Meas. Tech.Factor Xa Inhibition Assay
Ki 14±n/a nM
Citation Matter, HDefossa, EHeinelt, UBlohm, PMSchneider, DMuller, AHerok, SSchreuder, HLiesum, ABrachvogel, VLonze, PWalser, AAl-Obeidi, FWildgoose, P Design and quantitative structure-activity relationship of 3-amidinobenzyl-1H-indole-2-carboxamides as potent, nonchiral, and selective inhibitors of blood coagulation factor Xa. J Med Chem45:2749-69 (2002) 
 
Coagulation factor X
Name:Coagulation factor X
Type:Enzyme
Mol. Mass.:54726.60
Organism:Homo sapiens (Human)
Description:n/a
Residue:488
BDBM13898
BDBM12500
NameBDBM13898
Synonyms:2,2,2-trifluoroacetate; 4-[({1-[(3-carbamimidoylphenyl)methyl]-4-methyl-1H-indol-2-yl}formamido)methyl]-N,N,N-trimethylanilinium | 3-amidinobenzylindole carboxamide 83
TypeSmall organic molecule
Emp. Form.C28H32N5O
Mol. Mass.454.586
SMILESCc1cccc2n(Cc3cccc(c3)C(N)=N)c(cc12)C(=O)NCc1ccc(cc1)[N+](C)(C)C