Reaction Details
TargetNuclear receptor ROR-gamma
LigandBDBM338460
Substrate/Competitorn/a
Meas. Tech.Binding Assay
IC50 1.000±n/a nM
Citation Fauber, BGobbi, ARene, Ovan Niel, MBGancia, EGaines, SLadduwahetty, TVesey, DWard, SWinship, P Aryl sultam derivatives as RORc modulators US Patent US9751873 Publication Date 9/5/2017
 
Nuclear receptor ROR-gamma
Name:Nuclear receptor ROR-gamma
Type:Enzyme Catalytic Domain
Mol. Mass.:58218.40
Organism:Homo sapiens (Human)
Description:P51449
Residue:518
BDBM338460
NameBDBM338460
Synonyms:(3S,6R)-2-[[2,5-difluoro-4-[(1R,5S)- 6-(1,2,4-triazol-4-yl)-3- azabicyclo[3.1.0]hexan-3- yl]phenyl]methyl]-3-ethyl-6- phenyl-thiazinane 1,1-dioxide | US9751873, Example 147
TypeSmall organic molecule
Emp. Form.C26H29F2N5O2S
Mol. Mass.513.603
SMILESCC[C@H]1CC[C@H](c2ccccc2)S(=O)(=O)N1Cc1cc(F)c(cc1F)N1C[C@H]2[C@@H](C1)[C@@H]2n1cnnc1