Reaction Details
TargetNuclear receptor ROR-gamma
LigandBDBM50132478
Substrate/Competitorn/a
Meas. Tech.Binding Assay
IC50 5.00±n/a nM
Citation Fauber, BGobbi, ARene, Ovan Niel, MBGancia, EGaines, SLadduwahetty, TVesey, DWard, SWinship, P Aryl sultam derivatives as RORc modulators US Patent US9751873 Publication Date 9/5/2017
 
Nuclear receptor ROR-gamma
Name:Nuclear receptor ROR-gamma
Type:Enzyme Catalytic Domain
Mol. Mass.:58218.40
Organism:Homo sapiens (Human)
Description:P51449
Residue:518
BDBM50132478
NameBDBM50132478
Synonyms:CHEMBL3634609 | US9751873, Example 157
TypeSmall organic molecule
Emp. Form.C25H27F2N5O2S
Mol. Mass.499.576
SMILES[H][C@@]12CN(C[C@]1([H])[C@H]2n1cnnc1)c1cc(F)c(CN2CCCC[C@@H](c3ccccc3)S2(=O)=O)cc1F