Reaction Details
TargetTyrosine-protein kinase JAK1
LigandBDBM202489
Substrate/Competitorn/a
Meas. Tech.JAK1 Kinase Assay
pH7.3±n/a
Temperature298.15±n/a K
IC50 0.30±n/a nM
Commentsextracted
Citation Zhang, XDong, QLiu, BZhu, YLi, XLan, J Pyrrole six-membered heteroaryl ring derivative, preparation method thereof, and medicinal uses thereof US Patent US9527851 Publication Date 12/27/2016
 
Tyrosine-protein kinase JAK1
Name:Tyrosine-protein kinase JAK1
Type:Protein
Mol. Mass.:133293.73
Organism:Homo sapiens (Human)
Description:P23458
Residue:1154
BDBM202489
NameBDBM202489
Synonyms:US9527851, example 99
TypeSmall organic molecule
Emp. Form.C21H27N7O4S
Mol. Mass.473.549
SMILESCN([C@@H]1C[C@H]2CN(C[C@H]2C1)C(=O)Oc1nc(OCC(C)(C)O)ns1)c1ncnc2[nH]ccc12