Reaction Details
TargetCoagulation factor X
LigandBDBM13940
Substrate/CompetitorBDBM13950
Meas. Tech.Enzyme Assay and Determination of the Inhibition Constants
Ki 17±n/a nM
Citation Katz, BAElrod, KLuong, CRice, MJMackman, RLSprengeler, PASpencer, JHataye, JJanc, JLink, JLitvak, JRai, RRice, KSideris, SVerner, EYoung, W A novel serine protease inhibition motif involving a multi-centered short hydrogen bonding network at the active site. J Mol Biol307:1451-86 (2001) 
 
Coagulation factor X
Name:Coagulation factor X
Type:Enzyme
Mol. Mass.:54726.60
Organism:Homo sapiens (Human)
Description:n/a
Residue:488
BDBM13940
BDBM13950
NameBDBM13940
Synonyms:2-(3-HYDROXY-PYRIDIN-2-YL)-1H-BENZOIMIDAZOLE-5-CARBOXAMIDINE {amino[2-(3-hydroxypyridin-2-yl)-1H-1,3-benzodiazol-5-yl]methylidene}azanium
TypeSmall organic molecule
Emp. Form.C13H12N5O
Mol. Mass.254.2667
SMILESNC(=[NH2+])c1ccc2nc([nH]c2c1)-c1ncccc1O