Reaction Details
TargetP2Y purinoceptor 1
LigandBDBM260885
Substrate/Competitorn/a
Meas. Tech.Scintillation Proximity Assay (SPA)
pH7.4±n/a
Temperature298.15±n/a K
Ki 4.50±n/a nM
Commentsextracted
Citation LHeureux, A 7-hydroxy-indolinyl antagonists of P2Y1 receptor US Patent US9540323 Publication Date 1/10/2017
 
P2Y purinoceptor 1
Name:P2Y purinoceptor 1
Type:Enzyme
Mol. Mass.:42090.25
Organism:Homo sapiens (Human)
Description:P47900
Residue:373
BDBM260885
NameBDBM260885
Synonyms:US9540323, 73 | US9540323, example 73
TypeSmall organic molecule
Emp. Form.C27H26F3N3O4
Mol. Mass.513.5082
SMILESCCC1(CC)CN(c2c1c(C=O)ccc2O)c1ccccc1NC(=O)Nc1ccc(OC(F)(F)F)cc1