Reaction Details
TargetP2Y purinoceptor 1
LigandBDBM260932
Substrate/Competitorn/a
Meas. Tech.Scintillation Proximity Assay (SPA)
pH7.4±n/a
Temperature298.15±n/a K
Ki 3.40±n/a nM
Commentsextracted
Citation LHeureux, A 7-hydroxy-indolinyl antagonists of P2Y1 receptor US Patent US9540323 Publication Date 1/10/2017
 
P2Y purinoceptor 1
Name:P2Y purinoceptor 1
Type:Enzyme
Mol. Mass.:42090.25
Organism:Homo sapiens (Human)
Description:P47900
Residue:373
BDBM260932
NameBDBM260932
Synonyms:US9540323, 124 | US9540323, example 124
TypeSmall organic molecule
Emp. Form.C27H23F3N4O3S
Mol. Mass.540.557
SMILESCC1(C)CN(c2c1c(ccc2O)-c1nccs1)c1ccccc1NC(=O)Nc1ccc(OC(F)(F)F)cc1