Reaction Details
TargetP2Y purinoceptor 1
LigandBDBM50045599
Substrate/Competitorn/a
Meas. Tech.Scintillation Proximity Assay (SPA)
pH7.4±n/a
Temperature298.15±n/a K
Ki 9.50±n/a nM
Commentsextracted
Citation LHeureux, A 7-hydroxy-indolinyl antagonists of P2Y1 receptor US Patent US9540323 Publication Date 1/10/2017
 
P2Y purinoceptor 1
Name:P2Y purinoceptor 1
Type:Enzyme
Mol. Mass.:42090.25
Organism:Homo sapiens (Human)
Description:P47900
Residue:373
BDBM50045599
NameBDBM50045599
Synonyms:CHEMBL3314313 US9540323, example 142
TypeSmall organic molecule
Emp. Form.C28H22ClF4N3O3S
Mol. Mass.592.004
SMILESCC1(C)CN(c2c1c(-c1ccc(Cl)s1)c(F)cc2O)c1ccccc1NC(=O)Nc1ccc(OC(F)(F)F)cc1