Reaction Details
TargetP2Y purinoceptor 1
LigandBDBM50045604
Substrate/Competitorn/a
Meas. Tech.Scintillation Proximity Assay (SPA)
pH7.4±n/a
Temperature298.15±n/a K
Ki 11±n/a nM
Commentsextracted
Citation LHeureux, A 7-hydroxy-indolinyl antagonists of P2Y1 receptor US Patent US9540323 Publication Date 1/10/2017
 
P2Y purinoceptor 1
Name:P2Y purinoceptor 1
Type:Enzyme
Mol. Mass.:42090.25
Organism:Homo sapiens (Human)
Description:P47900
Residue:373
BDBM50045604
NameBDBM50045604
Synonyms:CHEMBL3314317 US9540323, example 164
TypeSmall organic molecule
Emp. Form.C28H22F5N5O3
Mol. Mass.571.498
SMILESCC1(C)CN(c2c1c(c(F)cc2O)-c1ncc(F)cn1)c1ccccc1NC(=O)Nc1ccc(OC(F)(F)F)cc1