Reaction Details
TargetP2Y purinoceptor 1
LigandBDBM50045627
Substrate/Competitorn/a
Meas. Tech.Scintillation Proximity Assay (SPA)
pH7.4±n/a
Temperature298.15±n/a K
Ki 4.60±n/a nM
Commentsextracted
Citation LHeureux, A 7-hydroxy-indolinyl antagonists of P2Y1 receptor US Patent US9540323 Publication Date 1/10/2017
 
P2Y purinoceptor 1
Name:P2Y purinoceptor 1
Type:Enzyme
Mol. Mass.:42090.25
Organism:Homo sapiens (Human)
Description:P47900
Residue:373
BDBM50045627
NameBDBM50045627
Synonyms:CHEMBL3314307 US9540323, example 200
TypeSmall organic molecule
Emp. Form.C37H41FN4O2
Mol. Mass.592.7454
SMILESCC(C)CN1CCCC1c1ccc(NC(=O)Nc2ccccc2N2CC(C)(C)c3c2c(O)ccc3-c2ccc(F)cc2)cc1