Reaction Details
TargetTyrosine-protein phosphatase non-receptor type 2
LigandBDBM13972
Substrate/CompetitorBDBM13466
Meas. Tech.PTP1B and TCPTP Inhibition Assay
Ki 1200±n/a nM
Citation Liu, GSzczepankiewicz, BGPei, ZJanowick, DAXin, ZHajduk, PJAbad-Zapatero, CLiang, HHutchins, CWFesik, SWBallaron, SJStashko, MALubben, TMika, AKZinker, BATrevillyan, JMJirousek, MR Discovery and structure-activity relationship of oxalylarylaminobenzoic acids as inhibitors of protein tyrosine phosphatase 1B. J Med Chem46:2093-103 (2003) 
 
Tyrosine-protein phosphatase non-receptor type 2
Name:Tyrosine-protein phosphatase non-receptor type 2
Type:Protein
Mol. Mass.:48481.80
Organism:Homo sapiens (Human)
Description:P17706
Residue:415
BDBM13972
BDBM13466
NameBDBM13972
Synonyms:1:1 racemic mixture N-Acetyl-4-[(carboxycarbonyl)(2-carboxyphenyl)amino]3-isopropyl-N-pentylphenylalaninamide | Oxalylarylaminobenzoic Acid Analog 12c
TypeSmall organic molecule
Emp. Form.C28H35N3O7
Mol. Mass.525.5934
SMILESCCCCCNC(=O)C(Cc1ccc(N(C(=O)C(O)=O)c2ccccc2C(O)=O)c(c1)C(C)C)NC(C)=O