Reaction Details
TargetTyrosine-protein phosphatase non-receptor type 2
LigandBDBM13973
Substrate/CompetitorBDBM13466
Meas. Tech.PTP1B and TCPTP Inhibition Assay
Ki 1500±n/a nM
Citation Liu, GSzczepankiewicz, BGPei, ZJanowick, DAXin, ZHajduk, PJAbad-Zapatero, CLiang, HHutchins, CWFesik, SWBallaron, SJStashko, MALubben, TMika, AKZinker, BATrevillyan, JMJirousek, MR Discovery and structure-activity relationship of oxalylarylaminobenzoic acids as inhibitors of protein tyrosine phosphatase 1B. J Med Chem46:2093-103 (2003) 
 
Tyrosine-protein phosphatase non-receptor type 2
Name:Tyrosine-protein phosphatase non-receptor type 2
Type:Protein
Mol. Mass.:48481.80
Organism:Homo sapiens (Human)
Description:P17706
Residue:415
BDBM13973
BDBM13466
NameBDBM13973
Synonyms:2-({4-[2-acetamido-2-(pentylcarbamoyl)ethyl]-2-(2-hydroxyethyl)phenyl}amidoformic acid)benzoic acid Oxalylarylaminobenzoic Acid Analog 12d
TypeSmall organic molecule
Emp. Form.C27H33N3O8
Mol. Mass.527.5662
SMILESCCCCCNC(=O)C(Cc1ccc(N(C(=O)C(O)=O)c2ccccc2C(O)=O)c(CCO)c1)NC(C)=O