Reaction Details
TargetAmine oxidase [flavin-containing] B
LigandBDBM339418
Substrate/Competitorn/a
Meas. Tech.Monoamine Oxidase Assays
Ki 20500±n/a nM
Citation Muñoz, AOCastro-Palomino Laria, JFyfe, MC Lysine specific demethylase-1 inhibitors and their use US Patent US10202330 Publication Date 2/12/2019
 
Amine oxidase [flavin-containing] B
Name:Amine oxidase [flavin-containing] B
Type:Protein
Mol. Mass.:58768.76
Organism:Homo sapiens (Human)
Description:P27338
Residue:520
BDBM339418
NameBDBM339418
Synonyms:US10202330, Example 9
TypeSmall organic molecule
Emp. Form.C25H24ClNO
Mol. Mass.389.917
SMILESCOc1ccc2CCC(N[C@H]3CC3c3ccc(cc3)-c3cccc(Cl)c3)c2c1