Reaction Details
TargetAmine oxidase [flavin-containing] A
LigandBDBM339420
Substrate/Competitorn/a
Meas. Tech.Monoamine Oxidase Assays
Ki 20500±n/a nM
Citation Muñoz, AOCastro-Palomino Laria, JFyfe, MC Lysine specific demethylase-1 inhibitors and their use US Patent US10202330 Publication Date 2/12/2019
 
Amine oxidase [flavin-containing] A
Name:Amine oxidase [flavin-containing] A
Type:Protein
Mol. Mass.:59689.53
Organism:Homo sapiens (Human)
Description:P21397
Residue:527
BDBM339420
NameBDBM339420
Synonyms:US10202330, Example 11
TypeSmall organic molecule
Emp. Form.C26H27NO2
Mol. Mass.385.4981
SMILESCOc1ccc2CCC(N[C@H]3CC3c3ccc(cc3)-c3cccc(OC)c3)c2c1