Reaction Details
TargetLysine-specific histone demethylase 1A
LigandBDBM339420
Substrate/Competitorn/a
Meas. Tech.LSD1 Assay
Ki 50±n/a nM
Citation Muñoz, AOCastro-Palomino Laria, JFyfe, MC Lysine specific demethylase-1 inhibitors and their use US Patent US10202330 Publication Date 2/12/2019
 
Lysine-specific histone demethylase 1A
Name:Lysine-specific histone demethylase 1A
Type:Enzyme
Mol. Mass.:92901.01
Organism:Homo sapiens (Human)
Description:O60341
Residue:852
BDBM339420
NameBDBM339420
Synonyms:US10202330, Example 11
TypeSmall organic molecule
Emp. Form.C26H27NO2
Mol. Mass.385.4981
SMILESCOc1ccc2CCC(N[C@H]3CC3c3ccc(cc3)-c3cccc(OC)c3)c2c1