Reaction Details
TargetLysine-specific histone demethylase 1A
LigandBDBM339423
Substrate/Competitorn/a
Meas. Tech.LSD1 Assay
Ki 550±n/a nM
Citation Muñoz, AOCastro-Palomino Laria, JFyfe, MC Lysine specific demethylase-1 inhibitors and their use US Patent US10202330 Publication Date 2/12/2019
 
Lysine-specific histone demethylase 1A
Name:Lysine-specific histone demethylase 1A
Type:Enzyme
Mol. Mass.:92901.01
Organism:Homo sapiens (Human)
Description:O60341
Residue:852
BDBM339423
NameBDBM339423
Synonyms:US10202330, Example 14
TypeSmall organic molecule
Emp. Form.C18H27N
Mol. Mass.257.4137
SMILESC(CC1CCCCCC1)N[C@H]1CC1c1ccccc1