Reaction Details
TargetFibroblast growth factor receptor 1
LigandBDBM339798
Substrate/Competitorn/a
Meas. Tech.FGFR1 (Enzymatic Assay)
IC50 2.51±n/a nM
Citation Angibaud, PRObringer, MMarin, JJJeanty, M Naphthyridine derivative compounds US Patent US9757364 Publication Date 9/12/2017
 
Fibroblast growth factor receptor 1
Name:Fibroblast growth factor receptor 1
Type:Receptor
Mol. Mass.:91861.70
Organism:Homo sapiens (Human)
Description:P11362
Residue:822
BDBM339798
NameBDBM339798
Synonyms:US9757364, Compound 1
TypeSmall organic molecule
Emp. Form.C22H23N5O3
Mol. Mass.405.4497
SMILESCOc1cc(OC)cc(c1)N(CCO)c1ccc2ncc(cc2n1)-c1cnn(C)c1