Reaction Details
TargetFibroblast growth factor receptor 4
LigandBDBM339803
Substrate/Competitorn/a
Meas. Tech.FGFR4 (Enzymatic Assay)
IC50 1.000±n/a nM
Citation Angibaud, PRObringer, MMarin, JJJeanty, M Naphthyridine derivative compounds US Patent US9757364 Publication Date 9/12/2017
 
Fibroblast growth factor receptor 4
Name:Fibroblast growth factor receptor 4
Type:Protein
Mol. Mass.:87957.45
Organism:Homo sapiens (Human)
Description:P22455
Residue:802
BDBM339803
NameBDBM339803
Synonyms:US9757364, Compound 10
TypeSmall organic molecule
Emp. Form.C24H23N7O2
Mol. Mass.441.4851
SMILESCOc1cc(OC)cc(c1)N(Cc1ncc[nH]1)c1ccc2ncc(cc2n1)-c1cnn(C)c1