Reaction Details
TargetFibroblast growth factor receptor 2
LigandBDBM339804
Substrate/Competitorn/a
Meas. Tech.FGFR2 (Enzymatic Assay)
IC50 3.16±n/a nM
Citation Angibaud, PRObringer, MMarin, JJJeanty, M Naphthyridine derivative compounds US Patent US9757364 Publication Date 9/12/2017
 
Fibroblast growth factor receptor 2
Name:Fibroblast growth factor receptor 2
Type:Enzyme
Mol. Mass.:92015.45
Organism:Homo sapiens (Human)
Description:P21802
Residue:821
BDBM339804
NameBDBM339804
Synonyms:US9757364, Compound 2
TypeSmall organic molecule
Emp. Form.C23H25N5O3
Mol. Mass.419.4763
SMILESCOc1cc(OC)cc(c1)N(CCCO)c1ccc2ncc(cc2n1)-c1cnn(C)c1