Reaction Details
TargetFibroblast growth factor receptor 3
LigandBDBM339807
Substrate/Competitorn/a
Meas. Tech.FGFR3 (Enzymatic Assay)
IC50 0.501±n/a nM
Citation Angibaud, PRObringer, MMarin, JJJeanty, M Naphthyridine derivative compounds US Patent US9757364 Publication Date 9/12/2017
 
Fibroblast growth factor receptor 3
Name:Fibroblast growth factor receptor 3
Type:Protein
Mol. Mass.:87699.57
Organism:Homo sapiens (Human)
Description:P22607
Residue:806
BDBM339807
NameBDBM339807
Synonyms:US9757364, Compound 11
TypeSmall organic molecule
Emp. Form.C23H24ClN5O3
Mol. Mass.453.921
SMILESCOc1cc(OC)cc(c1)N(CCCO)c1ccc2ncc(-c3cnn(C)c3)c(Cl)c2n1