Reaction Details
TargetFibroblast growth factor receptor 3
LigandBDBM339811
Substrate/Competitorn/a
Meas. Tech.FGFR3 (Enzymatic Assay)
IC50 1.29±n/a nM
Citation Angibaud, PRObringer, MMarin, JJJeanty, M Naphthyridine derivative compounds US Patent US9757364 Publication Date 9/12/2017
 
Fibroblast growth factor receptor 3
Name:Fibroblast growth factor receptor 3
Type:Protein
Mol. Mass.:87699.57
Organism:Homo sapiens (Human)
Description:P22607
Residue:806
BDBM339811
NameBDBM339811
Synonyms:US9757364, Compound 65
TypeSmall organic molecule
Emp. Form.C24H21F2N7O2
Mol. Mass.477.466
SMILESCOc1cc(OC)c(F)c(N(Cc2ncc[nH]2)c2ccc3ncc(cc3n2)-c2cnn(C)c2)c1F