Reaction Details
TargetFibroblast growth factor receptor 1
LigandBDBM339812
Substrate/Competitorn/a
Meas. Tech.FGFR1 (Enzymatic Assay)
IC50 0.977±n/a nM
Citation Angibaud, PRObringer, MMarin, JJJeanty, M Naphthyridine derivative compounds US Patent US9757364 Publication Date 9/12/2017
 
Fibroblast growth factor receptor 1
Name:Fibroblast growth factor receptor 1
Type:Receptor
Mol. Mass.:91861.70
Organism:Homo sapiens (Human)
Description:P11362
Residue:822
BDBM339812
NameBDBM339812
Synonyms:US9757364, Compound 26
TypeSmall organic molecule
Emp. Form.C25H28F2N6O2
Mol. Mass.482.5256
SMILESCOc1cc(OC)c(F)c(N(CCNC(C)C)c2ccc3ncc(cc3n2)-c2cnn(C)c2)c1F