Reaction Details
TargetFibroblast growth factor receptor 3
LigandBDBM339822
Substrate/Competitorn/a
Meas. Tech.FGFR3 (Enzymatic Assay)
IC50 0.550±n/a nM
Citation Angibaud, PRObringer, MMarin, JJJeanty, M Naphthyridine derivative compounds US Patent US9757364 Publication Date 9/12/2017
 
Fibroblast growth factor receptor 3
Name:Fibroblast growth factor receptor 3
Type:Protein
Mol. Mass.:87699.57
Organism:Homo sapiens (Human)
Description:P22607
Residue:806
BDBM339822
NameBDBM339822
Synonyms:US9757364, Compound 15
TypeSmall organic molecule
Emp. Form.C22H22ClN5O3
Mol. Mass.439.895
SMILESCOc1cc(OC)cc(c1)N(CCO)c1ccc2ncc(-c3cnn(C)c3)c(Cl)c2n1