Reaction Details
TargetFibroblast growth factor receptor 4
LigandBDBM339825
Substrate/Competitorn/a
Meas. Tech.FGFR4 (Enzymatic Assay)
IC50 3.31±n/a nM
Citation Angibaud, PRObringer, MMarin, JJJeanty, M Naphthyridine derivative compounds US Patent US9757364 Publication Date 9/12/2017
 
Fibroblast growth factor receptor 4
Name:Fibroblast growth factor receptor 4
Type:Protein
Mol. Mass.:87957.45
Organism:Homo sapiens (Human)
Description:P22455
Residue:802
BDBM339825
NameBDBM339825
Synonyms:US9757364, Compound 31
TypeSmall organic molecule
Emp. Form.C25H28N6O2
Mol. Mass.444.5288
SMILESCOc1cc(OC)cc(c1)N(C1CCNCC1)c1ccc2ncc(cc2n1)-c1cnn(C)c1