Reaction Details
TargetFibroblast growth factor receptor 3
LigandBDBM339828
Substrate/Competitorn/a
Meas. Tech.FGFR3 (Enzymatic Assay)
IC50 3.47±n/a nM
Citation Angibaud, PRObringer, MMarin, JJJeanty, M Naphthyridine derivative compounds US Patent US9757364 Publication Date 9/12/2017
 
Fibroblast growth factor receptor 3
Name:Fibroblast growth factor receptor 3
Type:Protein
Mol. Mass.:87699.57
Organism:Homo sapiens (Human)
Description:P22607
Residue:806
BDBM339828
NameBDBM339828
Synonyms:US9757364, Compound 30
TypeSmall organic molecule
Emp. Form.C23H25FN6O2
Mol. Mass.436.482
SMILESCNCCN(c1ccc2ncc(cc2n1)-c1cnn(C)c1)c1cc(OC)cc(OC)c1F