Reaction Details
TargetFibroblast growth factor receptor 4
LigandBDBM339828
Substrate/Competitorn/a
Meas. Tech.FGFR4 (Enzymatic Assay)
IC50 5.01±n/a nM
Citation Angibaud, PRObringer, MMarin, JJJeanty, M Naphthyridine derivative compounds US Patent US9757364 Publication Date 9/12/2017
 
Fibroblast growth factor receptor 4
Name:Fibroblast growth factor receptor 4
Type:Protein
Mol. Mass.:87957.45
Organism:Homo sapiens (Human)
Description:P22455
Residue:802
BDBM339828
NameBDBM339828
Synonyms:US9757364, Compound 30
TypeSmall organic molecule
Emp. Form.C23H25FN6O2
Mol. Mass.436.482
SMILESCNCCN(c1ccc2ncc(cc2n1)-c1cnn(C)c1)c1cc(OC)cc(OC)c1F