Reaction Details
TargetFibroblast growth factor receptor 2
LigandBDBM339836
Substrate/Competitorn/a
Meas. Tech.FGFR2 (Enzymatic Assay)
IC50 3.72±n/a nM
Citation Angibaud, PRObringer, MMarin, JJJeanty, M Naphthyridine derivative compounds US Patent US9757364 Publication Date 9/12/2017
 
Fibroblast growth factor receptor 2
Name:Fibroblast growth factor receptor 2
Type:Enzyme
Mol. Mass.:92015.45
Organism:Homo sapiens (Human)
Description:P21802
Residue:821
BDBM339836
NameBDBM339836
Synonyms:US9757364, Compound 34
TypeSmall organic molecule
Emp. Form.C24H21Cl2N7O2
Mol. Mass.510.375
SMILESCOc1cc(OC)c(Cl)c(N(Cc2ncc[nH]2)c2ccc3ncc(cc3n2)-c2cnn(C)c2)c1Cl