Reaction Details
TargetVascular endothelial growth factor receptor 2
LigandBDBM339837
Substrate/Competitorn/a
Meas. Tech.KDR (VEGFR2) (Enzymatic Assay)
IC50 7.94±n/a nM
Citation Angibaud, PRObringer, MMarin, JJJeanty, M Naphthyridine derivative compounds US Patent US9757364 Publication Date 9/12/2017
 
Vascular endothelial growth factor receptor 2
Name:Vascular endothelial growth factor receptor 2
Type:Receptor Tyrosine Kinase
Mol. Mass.:151510.97
Organism:Homo sapiens (Human)
Description:P35968
Residue:1356
BDBM339837
NameBDBM339837
Synonyms:US9757364, Compound 40 | US9757364, Compound 43
TypeSmall organic molecule
Emp. Form.C25H25FN6O3
Mol. Mass.476.5028
SMILESCOc1cc(OC)c(F)c(c1)N(CC1CCC(=O)N1)c1ccc2ncc(cc2n1)-c1cnn(C)c1