Reaction Details
TargetVascular endothelial growth factor receptor 2
LigandBDBM339840
Substrate/Competitorn/a
Meas. Tech.KDR (VEGFR2) (Enzymatic Assay)
IC50 37.2±n/a nM
Citation Angibaud, PRObringer, MMarin, JJJeanty, M Naphthyridine derivative compounds US Patent US9757364 Publication Date 9/12/2017
 
Vascular endothelial growth factor receptor 2
Name:Vascular endothelial growth factor receptor 2
Type:Receptor Tyrosine Kinase
Mol. Mass.:151510.97
Organism:Homo sapiens (Human)
Description:P35968
Residue:1356
BDBM339840
NameBDBM339840
Synonyms:US9757364, Compound 37 | US9757364, Compound 41
TypeSmall organic molecule
Emp. Form.C25H26N6O3
Mol. Mass.458.5123
SMILESCOc1cc(OC)cc(c1)N(CC1CCC(=O)N1)c1ccc2ncc(cc2n1)-c1cnn(C)c1