Reaction Details
TargetFibroblast growth factor receptor 3
LigandBDBM339840
Substrate/Competitorn/a
Meas. Tech.FGFR3 (Enzymatic Assay)
IC50 1.35±n/a nM
Citation Angibaud, PRObringer, MMarin, JJJeanty, M Naphthyridine derivative compounds US Patent US9757364 Publication Date 9/12/2017
 
Fibroblast growth factor receptor 3
Name:Fibroblast growth factor receptor 3
Type:Protein
Mol. Mass.:87699.57
Organism:Homo sapiens (Human)
Description:P22607
Residue:806
BDBM339840
NameBDBM339840
Synonyms:US9757364, Compound 37 | US9757364, Compound 41
TypeSmall organic molecule
Emp. Form.C25H26N6O3
Mol. Mass.458.5123
SMILESCOc1cc(OC)cc(c1)N(CC1CCC(=O)N1)c1ccc2ncc(cc2n1)-c1cnn(C)c1