Reaction Details
TargetFibroblast growth factor receptor 2
LigandBDBM339843
Substrate/Competitorn/a
Meas. Tech.FGFR2 (Enzymatic Assay)
IC50 2.09±n/a nM
Citation Angibaud, PRObringer, MMarin, JJJeanty, M Naphthyridine derivative compounds US Patent US9757364 Publication Date 9/12/2017
 
Fibroblast growth factor receptor 2
Name:Fibroblast growth factor receptor 2
Type:Enzyme
Mol. Mass.:92015.45
Organism:Homo sapiens (Human)
Description:P21802
Residue:821
BDBM339843
NameBDBM339843
Synonyms:US9757364, Compound 42 | US9757364, Compound 44
TypeSmall organic molecule
Emp. Form.C25H24F2N6O3
Mol. Mass.494.4933
SMILESCOc1cc(OC)c(F)c(N(CC2CCC(=O)N2)c2ccc3ncc(cc3n2)-c2cnn(C)c2)c1F