Reaction Details
TargetFibroblast growth factor receptor 3
LigandBDBM339837
Substrate/Competitorn/a
Meas. Tech.FGFR3 (Enzymatic Assay)
IC50 1.48±n/a nM
Citation Angibaud, PRObringer, MMarin, JJJeanty, M Naphthyridine derivative compounds US Patent US9757364 Publication Date 9/12/2017
 
Fibroblast growth factor receptor 3
Name:Fibroblast growth factor receptor 3
Type:Protein
Mol. Mass.:87699.57
Organism:Homo sapiens (Human)
Description:P22607
Residue:806
BDBM339837
NameBDBM339837
Synonyms:US9757364, Compound 40 | US9757364, Compound 43
TypeSmall organic molecule
Emp. Form.C25H25FN6O3
Mol. Mass.476.5028
SMILESCOc1cc(OC)c(F)c(c1)N(CC1CCC(=O)N1)c1ccc2ncc(cc2n1)-c1cnn(C)c1