Reaction Details
TargetFibroblast growth factor receptor 3
LigandBDBM339846
Substrate/Competitorn/a
Meas. Tech.FGFR3 (Enzymatic Assay)
IC50 1.55±n/a nM
Citation Angibaud, PRObringer, MMarin, JJJeanty, M Naphthyridine derivative compounds US Patent US9757364 Publication Date 9/12/2017
 
Fibroblast growth factor receptor 3
Name:Fibroblast growth factor receptor 3
Type:Protein
Mol. Mass.:87699.57
Organism:Homo sapiens (Human)
Description:P22607
Residue:806
BDBM339846
NameBDBM339846
Synonyms:US9757364, Compound 46
TypeSmall organic molecule
Emp. Form.C23H24F2N6O2
Mol. Mass.454.4725
SMILESCNCCN(c1ccc2ncc(cc2n1)-c1cnn(C)c1)c1c(F)c(OC)cc(OC)c1F